SciDB 14.3 build error


#1

Hi,

I get a linking error building SciDB 14.3 on CentOS…

Linking CXX executable unit_tests
query/libqproc_lib.a(OperatorLibrary.cpp.o): In function `OperatorLibrary':
/home/scidb/dev/scidb-14.3.0.7383/src/query/ops/BuildInOps.inc:304: undefined reference to `scidb::get_logicalFactoryLogicalShow()'
collect2: ld returned 1 exit status
make[2]: *** [bin/scidb] Error 1
make[1]: *** [src/CMakeFiles/scidb.dir/all] Error 2
make[1]: *** Waiting for unfinished jobs....
../../src/query/libqproc_lib.a(OperatorLibrary.cpp.o): In function `OperatorLibrary':
/home/scidb/dev/scidb-14.3.0.7383/src/query/ops/BuildInOps.inc:304: undefined reference to `scidb::get_logicalFactoryLogicalShow()'
collect2: ld returned 1 exit status
make[2]: *** [tests/unit/unit_tests] Error 1
make[1]: *** [tests/unit/CMakeFiles/unit_tests.dir/all] Error 2
make: *** [all] Error 2
./run.py: ERROR: Command make failed: Abnormal return code: 2 on command ['/usr/bin/make', '-j4']

Any ideas?

Thanks,
Mike