Buliding SciDB14.12 Error


#1

When building “SciDB”./run.py setup is OK,But "./run.py make -j4#"
Error:
./run.py: ERROR: Command make failed: Abnormal return code: 2 on command [’/usr/bin/make’, ‘-j4’]
Make sure commands setup,make,install,start are performed (in that order) before stop,stopForce,tests.

I guess some packeges are missing. How can I find which is missing?


#2

Please post full output of ./run.py setup: we can make sure cmake has found everything.


#3

Oh, I am really sorry! I use it for Local development. It is single node.
./run.py setup :

[scidb@scidb01 scidbtrunk]$ ./run.py setup WARNING: Deleting old CMakeCache file:/home/scidb_source/scidbtrunk/stage/build/CMakeCache.txt WARNING: about to delete *all* contents of /home/scidb_source/scidbtrunk/stage/build/* [y]|n: y -- ****************** BEGIN CMakeLists.txt ****************** -- The C compiler identification is GNU 4.4.7 -- The CXX compiler identification is GNU 4.4.7 -- The Fortran compiler identification is GNU -- Check for working C compiler: /usr/lib64/ccache/cc -- Check for working C compiler: /usr/lib64/ccache/cc -- works -- Detecting C compiler ABI info -- Detecting C compiler ABI info - done -- Check for working CXX compiler: /usr/lib64/ccache/c++ -- Check for working CXX compiler: /usr/lib64/ccache/c++ -- works -- Detecting CXX compiler ABI info -- Detecting CXX compiler ABI info - done -- Check for working Fortran compiler: /usr/bin/gfortran -- Check for working Fortran compiler: /usr/bin/gfortran -- works -- Detecting Fortran compiler ABI info -- Detecting Fortran compiler ABI info - done -- Checking whether /usr/bin/gfortran supports Fortran 90 -- Checking whether /usr/bin/gfortran supports Fortran 90 -- yes -- CMAKE_INSTALL_PREFIX not Initialized to default keeping: /home/scidb_source/scidbtrunk/stage/install -- Found Subversion: /usr/bin/svn (found version "1.6.11") -- Found Git: /usr/bin/git (found version "1.7.1") -- Reading revision from file: 8698 -- Build type (use -DCMAKE_BUILD_TYPE=[RelWithDebInfo]/Debug/Release/Profile/CC/Valgrind): Debug -- DISTRO_NAME_VER is CentOS-6.4 -- Found PkgConfig: /usr/bin/pkg-config (found version "0.23") -- Found LibRT: /usr/lib64/librt.so -- Boost version: 1.54.0 -- Found the following Boost libraries: -- system -- program_options -- serialization -- regex -- filesystem -- thread -- date_time -- Found Protobuf: /usr/include/google/protobuf -- GPB - /usr/lib64/libprotobuf.so -- Found Log4CXX: /usr/lib64/liblog4cxx.so -- LOG4CXX - /usr/lib64/liblog4cxx.so -- Found Doxygen: /usr/bin/doxygen (found version "1.6.1") -- Found LibPQXX: /usr/lib -- Found LibPQ: /usr/bin/pg_config -- Found LibPQ: /usr/lib64 -- checking for module 'cppunit' -- found cppunit, version 1.12.1 -- Found SWIG2: /usr/bin/swig2 (Required is at least version "2.0") -- Found PythonLibs: /usr/local/lib/libpython2.7.a (found version "2.7.6") -- Found FLEX: /usr/bin/flex -- Found BISON: /usr/bin/bison -- Found SED: /bin/sed -- Found ZLIB: /usr/lib64/libz.so (found version "1.2.3") -- Found BZip2: /usr/lib64/libbz2.so (found version "1.0.5") -- Looking for BZ2_bzCompressInit in /usr/lib64/libbz2.so -- Looking for BZ2_bzCompressInit in /usr/lib64/libbz2.so - found -- Found LibReadline: /usr/lib64/libreadline.so -- Looking for include file pthread.h -- Looking for include file pthread.h - found -- Looking for pthread_create -- Looking for pthread_create - not found -- Looking for pthread_create in pthreads -- Looking for pthread_create in pthreads - not found -- Looking for pthread_create in pthread -- Looking for pthread_create in pthread - found -- Found Threads: TRUE -- Found PythonInterp: /usr/local/bin/python (found version "2.7.6") -- Looking for Fortran sgemm -- Looking for Fortran sgemm - found -- A library with BLAS API found. -- A library with BLAS API found. -- Looking for Fortran cheev -- Looking for Fortran cheev - found -- A library with LAPACK API found. -- Found XSLTPROC: /usr/bin/xsltproc -- Found FOP: /usr/bin/fop -- Found docbook.xsl: /usr/share/sgml/docbook/xsl-stylesheets-1.75.2/fo/docbook.xsl -- Looking for malloc_stats -- Looking for malloc_stats - found -- ****************** BEGIN src/CMakeLists.txt ****************** -- SWIG 2 and Python found. Python module will built -- Configuring /home/scidb_source/scidbtrunk/src/system/Constants.cpp.in as /home/scidb_source/scidbtrunk/stage/build/src/system/Constants.cpp -- Configuring /home/scidb_source/scidbtrunk/src/system/System.h.in as /home/scidb_source/scidbtrunk/stage/build/src/system/System.h -- Configuring /home/scidb_source/scidbtrunk/src/util/scidb-sample.conf.in as /home/scidb_source/scidbtrunk/stage/build/bin/packaging_only/scidb-sample.conf -- **BEGIN util/dmalloc/CMakeLists.txt -------------------------------- -- Debug: CMAKE_C_FLAGS is -pedantic -W -Wextra -Wall -Wno-long-long -Wno-unused-parameter -fPIC -D__STDC_FORMAT_MACROS -- Debug: CMAKE_CXX_FLAGS is -std=c++98 -pedantic -W -Wextra -Wall -Wno-strict-aliasing -Wno-long-long -Wno-unused-parameter -Wno-variadic-macros -fPIC -D__STDC_FORMAT_MACROS -Wno-system-headers -isystem /opt/local/include/ -isystem /usr/local/include/ -D__STDC_LIMIT_MACROS -DPROJECT_ROOT=\"/home/scidb_source/scidbtrunk/\" -- Debug: GENERAL_OUTPUT_DIRECTORY is /home/scidb_source/scidbtrunk/stage/build/bin -- **END util/dmalloc/CMakeLists.txt -------------------------------- -- ****************** BEGIN src/mpi/CMakeLists.txt ****************** -- WARNING-- using locally installed MPICH2 -- Local MPICH2 path: /opt/scidb/14.12/3rdparty/mpich2 -- WARNING-- using locally installed ScaLAPACK for MPICH2 -- Debug: To refresh/rebuild the local copy of scalapack, remove /home/scidb_source/scidbtrunk/stage/build/src/mpi/local_scalapack/container. -- ****************** BEGIN mpi/local_scalapack/CMakeLists.txt ****************** -- DEBUG BLAS_FOUND=TRUE LAPACK_FOUND=TRUE MPICH_FOUND=1 -- WARNING-- using locally built libscalapack.a -- DEBUG-- UNTAR_DIR=/home/scidb_source/scidbtrunk/stage/build/src/mpi/local_scalapack/container/src/scalapackForMPICH2 -- DEBUG-- MPICH2_SUFFIX= -- DEBUG-- MPI_INCLUDE=-I /opt/scidb/14.12/3rdparty/mpich2/include/mpich2 -- DEBUG-- BLAS_LIBRARIES=/usr/lib64/libblas.so -- DEBUG-- LOCAL_LAPACK_LIBRARIES=/usr/lib64/liblapack.so /usr/lib64/libblas.so -- DEBUG-- LOCAL_MPI_PATH=/opt/scidb/14.12/3rdparty/mpich2 -- DEBUG-- PRIMARY_STATUS=6 -- www.netlib.org is down. -- using mirror netlib.sandia.gov. -- Debug: SCALAPACK_LIBRARIES is /home/scidb_source/scidbtrunk/stage/build/src/mpi/local_scalapack/container/src/scalapackForMPICH2-build/install/lib/libscalapack.a -- Debug: SCALAPACK_INC_DIR is /home/scidb_source/scidbtrunk/stage/build/src/mpi/local_scalapack/container/src/scalapackForMPICH2-build/install/lib/include -- Debug: FINAL PACKAGE SETTINGS src/mpi ================================> -- Debug: SCALAPACK_LIBRARIES is /home/scidb_source/scidbtrunk/stage/build/src/mpi/local_scalapack/container/src/scalapackForMPICH2-build/install/lib/libscalapack.a -- Debug: LAPACK_LIBRARIES is /usr/lib64/liblapack.so;/usr/lib64/libblas.so -- Debug: BLAS_LIBRARIES is /usr/lib64/libblas.so -- Debug: MPI_LIBRARIES is /opt/scidb/14.12/3rdparty/mpich2/lib/libmpichf90.a -- Debug: MPI_INCLUDE is -I /opt/scidb/14.12/3rdparty/mpich2/include/mpich2 -- Debug: MPI_Fortran_COMPILER is /opt/scidb/14.12/3rdparty/mpich2/bin/mpif77 -- Debug: CMAKE_C_FLAGS is -pedantic -W -Wextra -Wall -Wno-long-long -Wno-unused-parameter -fPIC -D__STDC_FORMAT_MACROS -- Debug: CMAKE_CXX_FLAGS is -std=c++98 -pedantic -W -Wextra -Wall -Wno-strict-aliasing -Wno-long-long -Wno-unused-parameter -Wno-variadic-macros -fPIC -D__STDC_FORMAT_MACROS -Wno-system-headers -isystem /opt/local/include/ -isystem /usr/local/include/ -D__STDC_LIMIT_MACROS -DPROJECT_ROOT=\"/home/scidb_source/scidbtrunk/\" -DOMPI_IGNORE_CXX_SEEK -lgfortran -- Debug: CMAKE_Fortran_FLAGS is -fno-f2c -Wline-truncation -I/opt/scidb/14.12/3rdparty/mpich2/include/mpi -I/opt/scidb/14.12/3rdparty/boost/include/boost -- Debug: CMAKE_Fortran_COMPLIER is /usr/bin/gfortran -- Debug: CMAKE_CXX_COMPILER is /usr/lib64/ccache/c++ -- Debug: FINAL PACKAGE SETTINGS <================================ -- Debug: Building MPI Slave -- ****************** BEGIN mpi/slaving/CMakeLists.txt ****************** -- Debug: CMAKE_CXX_COMPLIER is /opt/scidb/14.12/3rdparty/mpich2/bin/mpic++ -- Debug: CMAKE_Fortran_COMPLIER is /opt/scidb/14.12/3rdparty/mpich2/bin/mpif77 -- Debug: CMAKE_C_FLAGS is -pedantic -W -Wextra -Wall -Wno-long-long -Wno-unused-parameter -fPIC -D__STDC_FORMAT_MACROS -I /opt/scidb/14.12/3rdparty/mpich2/include/mpich2 -I /home/scidb_source/scidbtrunk/stage/build/src/mpi/local_scalapack/container/src/scalapackForMPICH2-build/install/lib/include -- Debug: SCALAPACK_BUILD_DIR is /home/scidb_source/scidbtrunk/stage/build/src/mpi/local_scalapack/container/src/scalapackForMPICH2-build -- Debug: SCALAPACK_INC_DIR is /home/scidb_source/scidbtrunk/stage/build/src/mpi/local_scalapack/container/src/scalapackForMPICH2-build/install/lib/include -- ****************** END mpi/slaving/CMakeLists.txt ****************** -- ****************** END src/mpi/CMakeLists.txt ****************** -- *****BEGIN dense_linear_algebra/CMakeLists.txt *********************** -- Found MPI_C: /opt/scidb/14.12/3rdparty/mpich2/lib/libmpich.so;/opt/scidb/14.12/3rdparty/mpich2/lib/libopa.a;/usr/lib64/libpthread.so;/usr/lib64/librt.so -- Found MPI_CXX: /opt/scidb/14.12/3rdparty/mpich2/lib/libmpichcxx.so;/opt/scidb/14.12/3rdparty/mpich2/lib/libmpich.so;/opt/scidb/14.12/3rdparty/mpich2/lib/libopa.a;/usr/lib64/libpthread.so;/usr/lib64/librt.so -- Found MPI_Fortran: /opt/scidb/14.12/3rdparty/mpich2/lib/libmpich.so;/opt/scidb/14.12/3rdparty/mpich2/lib/libopa.a;/usr/lib64/libpthread.so;/usr/lib64/librt.so -- MPI_Fortran_COMPILER=/opt/scidb/14.12/3rdparty/mpich2/bin/mpif77 -- Debug: BLAS_LIBRARIES is /usr/lib64/libblas.so -- Debug: LAPACK_LIBRARIES is /usr/lib64/liblapack.so;/usr/lib64/libblas.so -- Debug: SCALAPACK_LIBRARIES is -- Debug: MPI_LIBRARIES is /opt/scidb/14.12/3rdparty/mpich2/lib/libmpichcxx.so;/opt/scidb/14.12/3rdparty/mpich2/lib/libmpich.so;/opt/scidb/14.12/3rdparty/mpich2/lib/libopa.a;/usr/lib64/libpthread.so;/usr/lib64/librt.so -- Debug: CMAKE_C_FLAGS is -pedantic -W -Wextra -Wall -Wno-long-long -Wno-unused-parameter -fPIC -D__STDC_FORMAT_MACROS -- Debug: CMAKE_CXX_FLAGS is -std=c++98 -pedantic -W -Wextra -Wall -Wno-strict-aliasing -Wno-long-long -Wno-unused-parameter -Wno-variadic-macros -fPIC -D__STDC_FORMAT_MACROS -Wno-system-headers -isystem /opt/local/include/ -isystem /usr/local/include/ -D__STDC_LIMIT_MACROS -DPROJECT_ROOT=\"/home/scidb_source/scidbtrunk/\" -- Debug: CMAKE_Fortran_FLAGS is -fno-f2c -Wline-truncation -I/opt/scidb/14.12/3rdparty/mpich2/include/mpi -I/opt/scidb/14.12/3rdparty/boost/include/boost -- Debug: MPI_Fortran_COMPILER is /opt/scidb/14.12/3rdparty/mpich2/bin/mpif77 -- *****END linear_algebra/CMakeLists.txt *********************** -- **BEGIN linear_algebra/CMakeLists.txt -------------------------------- -- Debug: CMAKE_C_FLAGS is -pedantic -W -Wextra -Wall -Wno-long-long -Wno-unused-parameter -fPIC -D__STDC_FORMAT_MACROS -- Debug: CMAKE_CXX_FLAGS is -std=c++98 -pedantic -W -Wextra -Wall -Wno-strict-aliasing -Wno-long-long -Wno-unused-parameter -Wno-variadic-macros -fPIC -D__STDC_FORMAT_MACROS -Wno-system-headers -isystem /opt/local/include/ -isystem /usr/local/include/ -D__STDC_LIMIT_MACROS -DPROJECT_ROOT=\"/home/scidb_source/scidbtrunk/\" -- **END linear_algebra/CMakeLists.txt -------------------------------- -- Found Java6: /usr/lib/jvm/java-1.6.0-openjdk.x86_64/bin/java -- ****************** END src/CMakeLists.txt ****************** -- Configuring /home/scidb_source/scidbtrunk/doc/api/Doxyfile.in as /home/scidb_source/scidbtrunk/stage/build/doc/api/Doxyfile -- Documentation will not be generated automatically. Use -DSCIDB_DOC_TYPE={NONE,FULL,API} to set type of generated documentation. Use make doc to generate FULL documentation manually. -- copying /home/scidb_source/scidbtrunk/cdash to /home/scidb_source/scidbtrunk/stage/build/cdash -- copying /home/scidb_source/scidbtrunk/tests to /home/scidb_source/scidbtrunk/stage/build/tests -- copying /home/scidb_source/scidbtrunk/tests/harness/testcases/t to /home/scidb_source/scidbtrunk/stage/build/tests/harness/testcases/t -- ****************** END CMakeLists.txt ****************** -- Configuring done -- Generating done -- Build files have been written to: /home/scidb_source/scidbtrunk/stage/build

./run.py make -j4 error:

[code][scidb@scidb01 scidbtrunk]$ ./run.py make -j4

[ 0%] Scanning dependencies of target json_lib
Scanning dependencies of target genmeta
Scanning dependencies of target MurmurHash_lib
Running protocol buffer compiler on /home/scidb_source/scidbtrunk/src/network/proto/scidb_msg.proto
[ 0%] [ 0%] Generating CatalogMetadata.h
Building CXX object extern/MurmurHash/CMakeFiles/MurmurHash_lib.dir/MurmurHash3.cpp.o
Linking CXX static library libMurmurHash_lib.a
[ 0%] Building CXX object extern/lib_json/CMakeFiles/json_lib.dir/json_reader.cpp.o
Scanning dependencies of target scidb_msg_lib
[ 1%] Building CXX object src/network/proto/CMakeFiles/scidb_msg_lib.dir/scidb_msg.pb.cc.o
[ 1%] Built target genmeta
[ 1%] Built target MurmurHash_lib
Scanning dependencies of target dmalloc
Scanning dependencies of target scalapackForMPICH2
[ 1%] [ 1%] Building CXX object src/util/dmalloc/CMakeFiles/dmalloc.dir/dmalloc.cpp.o
Creating directories for ‘scalapackForMPICH2’
[ 1%] Performing download step (download, verify and extract) for ‘scalapackForMPICH2’
– downloading…
src=‘http://netlib.sandia.gov/scalapack/scalapack_installer.tgz
dst=’/home/scidb_source/scidbtrunk/stage/build/src/mpi/local_scalapack/container/src/scalapack_installer.tgz’
timeout='120 seconds’
Linking CXX shared library …/…/…/bin/libdmalloc.so
[ 1%] Built target dmalloc
Scanning dependencies of target linear_algebra
[ 1%] Building CXX object extern/lib_json/CMakeFiles/json_lib.dir/json_writer.cpp.o
Linking CXX static library libscidb_msg_lib.a
[ 2%] Building CXX object extern/lib_json/CMakeFiles/json_lib.dir/json_value.cpp.o
[ 2%] Built target scidb_msg_lib
Scanning dependencies of target jdbc_build
Linking CXX static library libjson_lib.a
[ 2%] Generating …/…/bin/jdbc/jdbctest.jar, …/…/bin/jdbc/jiquery.jar, …/…/bin/jdbc/scidb4j.jar, …/…/bin/jdbc/example.jar, …/…/bin/jdbc/scidb-example.war
[ 2%] Built target json_lib
Scanning dependencies of target benchGen
[ 2%] Building CXX object utils/CMakeFiles/benchGen.dir/benchGen.cc.o
Linking CXX executable …/bin/benchGen
[ 2%] Built target benchGen
Scanning dependencies of target osplitcsv
[ 2%] Building C object utils/CMakeFiles/osplitcsv.dir/splitcsv.c.o
Linking C executable …/bin/osplitcsv
[ 2%] Built target osplitcsv
Scanning dependencies of target shimsvc
[ 2%] Built target shimsvc
Scanning dependencies of target dgenerator
[ 2%] Building CXX object tests/data_gen/CMakeFiles/dgenerator.dir/dgenerator.cpp.o
Linking CXX executable dgenerator
[ 2%] Built target dgenerator
Scanning dependencies of target gen_matrix
[ 2%] Building CXX object tests/data_gen/CMakeFiles/gen_matrix.dir/gen_matrix.cpp.o
Linking CXX executable …/…/bin/gen_matrix
[ 2%] Built target gen_matrix
Scanning dependencies of target arg_separator
[ 2%] Building CXX object tests/harness/CMakeFiles/arg_separator.dir/src/arg_separator.cc.o
Linking CXX executable …/…/bin/arg_separator
[ 2%] Built target arg_separator
Scanning dependencies of target preparecdashreport
Buildfile: /home/scidb_source/scidbtrunk/src/jdbc/build.xml
[ 2%] Building CXX object tests/harness/CMakeFiles/preparecdashreport.dir/src/helper.cpp.o
[ 3%] Building CXX object tests/harness/CMakeFiles/preparecdashreport.dir/src/errdb.cpp.o
[ 3%] Building CXX object tests/harness/CMakeFiles/preparecdashreport.dir/src/Exceptions.cpp.o
[ 3%] Building CXX object tests/harness/CMakeFiles/preparecdashreport.dir/src/xmlarchive.cpp.o

configure:
[propertyfile] Creating new property file: /home/scidb_source/scidbtrunk/stage/build/src/jdbc/configure.properties
[ 3%] Building CXX object tests/harness/CMakeFiles/preparecdashreport.dir/src/reporter.cpp.o
[echo] build_dir is set to /home/scidb_source/scidbtrunk/stage/build/src/jdbc/build
[echo] dist_dir is set to /home/scidb_source/scidbtrunk/stage/build/bin/jdbc
[echo] deps_dir is set to /home/scidb_source/scidbtrunk/stage/build/src/jdbc/deps
[echo] report_dir is set to /home/scidb_source/scidbtrunk/stage/build/src/jdbc/report
[echo] doc_dir is set to
[echo] junit_lib is set to /usr/share/java/junit.jar
[echo] protobuf_lib is set to /usr/share/java/protobuf.jar
[echo] java.version is set to 1.6.0_34
[echo] java.runtime.version is set to 1.6.0_34-b34
[echo] debug is set to off
[ 3%]
BUILD SUCCESSFUL
Total time: 9 seconds
Building CXX object tests/harness/CMakeFiles/preparecdashreport.dir/src/cdashreportstructs.cpp.o
[ 4%] Building CXX object tests/harness/CMakeFiles/preparecdashreport.dir/src/cdashreportapp.cpp.o
[ 4%] Building CXX object tests/harness/CMakeFiles/preparecdashreport.dir/src/preparecdashreport.cpp.o
Buildfile: /home/scidb_source/scidbtrunk/src/jdbc/build.xml
Linking CXX executable preparecdashreport

init:
CMake Error at scalapackForMPICH2-stamp/download-scalapackForMPICH2.cmake:22 (message):
error: downloading
http://netlib.sandia.gov/scalapack/scalapack_installer.tgz’ failed

status_code: 6
status_string: "Couldn't resolve host name"
log: getaddrinfo(3) failed for netlib.sandia.gov:80

Couldn’t resolve host ‘netlib.sandia.gov

Closing connection #0

Couldn’t resolve host name

[mkdir] Created dir: /home/scidb_source/scidbtrunk/stage/build/src/jdbc/build/scidb4j
[mkdir] Created dir: /home/scidb_source/scidbtrunk/stage/build/src/jdbc/build/jiquery
[mkdir] Created dir: /home/scidb_source/scidbtrunk/stage/build/src/jdbc/build/jdbctest
[mkdir] Created dir: /home/scidb_source/scidbtrunk/stage/build/src/jdbc/build/example
[mkdir] Created dir: /home/scidb_source/scidbtrunk/stage/build/src/jdbc/build/test
[mkdir] Created dir: /home/scidb_source/scidbtrunk/stage/build/bin/jdbc
[mkdir] Created dir: /home/scidb_source/scidbtrunk/stage/build/src/jdbc/report

Trying to override old definition of task javac

gen.protocol:
[echo] Compiling scidb_msg.proto
make[2]: *** [src/mpi/local_scalapack/container/src/scalapackForMPICH2-stamp/scalapackForMPICH2-download] Error 1
make[1]: *** [src/mpi/local_scalapack/CMakeFiles/scalapackForMPICH2.dir/all] Error 2
make[1]: *** Waiting for unfinished jobs…

build.scidb4j:
[javac] Compiling 25 source files to /home/scidb_source/scidbtrunk/stage/build/src/jdbc/build/scidb4j
[ 4%] Built target preparecdashreport
[ 4%] [ 4%] [ 4%] Building CXX object src/linear_algebra/CMakeFiles/linear_algebra.dir/plugin.cpp.o
Building CXX object src/linear_algebra/CMakeFiles/linear_algebra.dir/spgemm/PhysicalSpgemm.cpp.o
Building CXX object src/linear_algebra/CMakeFiles/linear_algebra.dir/spgemm/LogicalSpgemm.cpp.o
[ 4%] Building CXX object src/linear_algebra/CMakeFiles/linear_algebra.dir/stats/HypergeometricFunctions.cpp.o
Linking CXX shared library …/…/bin/plugins/liblinear_algebra.so
[ 4%] Built target linear_algebra
[jar] Building jar: /home/scidb_source/scidbtrunk/stage/build/bin/jdbc/scidb4j.jar

build.jiquery:
[javac] Compiling 1 source file to /home/scidb_source/scidbtrunk/stage/build/src/jdbc/build/jiquery
[jar] Building jar: /home/scidb_source/scidbtrunk/stage/build/bin/jdbc/jiquery.jar

build.jdbctest:
[javac] Compiling 2 source files to /home/scidb_source/scidbtrunk/stage/build/src/jdbc/build/jdbctest
[jar] Building jar: /home/scidb_source/scidbtrunk/stage/build/bin/jdbc/jdbctest.jar

build.example:
[javac] Compiling 1 source file to /home/scidb_source/scidbtrunk/stage/build/src/jdbc/build/example
[jar] Building jar: /home/scidb_source/scidbtrunk/stage/build/bin/jdbc/example.jar

war:
[mkdir] Created dir: /home/scidb_source/scidbtrunk/stage/build/src/jdbc/jsp/scidb-example/WEB-INF/lib
[copy] Copying 1 file to /home/scidb_source/scidbtrunk/stage/build/src/jdbc/jsp/scidb-example/WEB-INF/lib
[copy] Copying /home/scidb_source/scidbtrunk/stage/build/bin/jdbc/scidb4j.jar to /home/scidb_source/scidbtrunk/stage/build/src/jdbc/jsp/scidb-example/WEB-INF/lib/scidb4j.jar
[copy] Copying 1 file to /home/scidb_source/scidbtrunk/stage/build/src/jdbc/jsp/scidb-example/WEB-INF/lib
[copy] Copying /usr/share/java/protobuf.jar to /home/scidb_source/scidbtrunk/stage/build/src/jdbc/jsp/scidb-example/WEB-INF/lib/protobuf.jar
[war] Building war: /home/scidb_source/scidbtrunk/stage/build/bin/jdbc/scidb-example.war

all:

BUILD SUCCESSFUL
Total time: 22 seconds
[ 4%] Built target jdbc_build
make: *** [all] Error 2
./run.py: ERROR: Command make failed: Abnormal return code: 2 on command [’/usr/bin/make’, ‘-j4’]
Make sure commands setup,make,install,start are performed (in that order) before stop,stopForce,tests
[/code]

I am a fresh man. So could you please explain in detail? Thanks very much. :smile:


#4

Here is what is happening.
On setup it finds that www.netlib.org is down and switches to netlib.sandia.gov. This is settings in your Makefile (not actually testing the backup site).
When you run make it then is hardwired to get from netlib.sandia.gov which apparently is now down.

I suggest you rerun the setup part, look at the output to see that netlib.org is up and then you are good to go.
and in case you network is blocked/broken/bit-bucketed… try pinging www.netlib.org and netlib.sandia.gov