Build Errors


#1

I am posting this here because I tried searching for “build error” or “error 2” to find previous posts but I cannot search this forum easily. I keep getting this error for example -

[quote]
The following words in your search query were ignored because they are too common words: build error.
You must specify at least one word to search for. Each word must consist of at least 3 characters and must not contain more than 14 characters excluding wildcards.[/quote]
Sorry about posting this again. Please feel free to correct or direct me.

Problem -
I could run this successfully -

But the next step (./run.py make -j4) fails and I do not understand what is possibly wrong -

Linking CXX shared library ../../bin/plugins/libmisc.so
[ 11%] Built target misc
make: *** [all] Error 2
./run.py: ERROR: Command make failed: Abnormal return code: 2 on command ['/usr/bin/make', '-j4']
Make sure commands setup,make,install,start are performed (in that order) before stop,stopForce,tests

I tried make without “-j4” and it failed at around 55%

make[2]: *** [src/query/ops/CMakeFiles/ops_lib.dir/uniq/PhysicalUniq.cpp.o] Error 1 make[1]: *** [src/query/ops/CMakeFiles/ops_lib.dir/all] Error 2 make: *** [all] Error 2 ./run.py: ERROR: Command make failed: Abnormal return code: 2 on command ['/usr/bin/make', '-j1'] Make sure commands setup,make,install,start are performed (in that order) before stop,stopForce,tests

I am not sure what I am doing wrong.

I am on Ubuntu 13.10. amd_64. I have 16GB of RAM on the system.


#2

Ubuntu 13.10 is not supported. Currently, only Ubuntu 12.04 is supported.